{"text_format":"1","workbook":"xlsx","n_sheets":5,"sheets":["REGOLE","TT Categorie cespite","NO COSTO STANDARD","COSTO STANDARD","CTRL"],"not_rendered":{"charts":0,"images":0,"macros":1,"external_links":0,"defined_names":0,"comments":0,"pivot_tables":0},"unopened":[],"bounds":{"document_bytes":16777216,"sheet_cells":100000,"rows_first":2000,"rows_last":500,"rows_between":2000,"halvings":0,"cell_chars":16384,"cell_head_chars":4096},"cells_cut":0,"cells_raw":0,"read":"whole","date_system":"1900"}

{"sheet":"REGOLE","index":0,"n_rows":15,"n_cols":3,"rows_kept":15,"cut":false,"hidden":false,"merged":[[11,1,11,2],[11,0,12,0],[12,1,12,2],[13,1,13,2],[13,0,14,0],[7,0,8,0],[7,1,7,2],[9,1,9,2],[2,0,3,0],[2,1,2,2],[4,0,5,0],[4,1,4,2],[6,1,6,2]]}
[]
[null,"foglio di lavoro \"NO COSTO STANDARD\"","foglio di lavoro \"COSTO STANDARD\""]
["ANNO CESPITE (c)","Anno di entrata in esercizio del misuratore"]
[null,"REGOLE:\n- ANNO CESPITE < ANNO DATI DISMISSIONE; \n- ANNO CESPITE <2012 se CATEGORIA CESPITE=5. \n","REGOLE:\n- ANNO CESPITE >=2012;\n- ANNO CESPITE < ANNO DATI DISMISSIONE."]
["ANNO DATI DISMISSIONE (t)","Anno in cui il misuratore è stato disinstallato per verifica metrologica"]
[null,"REGOLE:\n- ANNO DATI DISMISSIONE >2008;\n- ANNO DATI DISMISSIONE > ANNO CESPITE;\n- ANNO DATI DISMISSIONE < ANNO DATI REINSTALLAZIONE.","REGOLE:\n- ANNO DATI DISMISSIONE > ANNO CESPITE;\n- ANNO DATI DISMISSIONE < ANNO DATI REINSTALLAZIONE."]
[null,"Costo di acquisizione del cespite al momento della sua prima utilizzazione ovvero costo di realizzazione dello stesso nell'anno di messa in esercizio come risulta dalle fonti contabili obbligatorie (comma 10.1 RTDG)"]
["ID CATEGORIA CESPITE (g)","Identificativo attribuito alla categoria di cespite in esame desumibile dal foglio di lavoro \"TT categorie cespite\"."]
[null,"REGOLE: \n- CATEGORIA CESPITE = 5 o 6;\n- CATEGORIA CESPITE = 13 non ammessa.","REGOLE: \n- CATEGORIA CESPITE = 5 o 13\n- CATEGORIA CESPITE = 6 non ammessa."]
["ID ELEMENTO","Identificativo attribuito al tipo di misuratore in esame desumibile dal foglio di lavoro \"TT categorie cespite\""]
["INDICE GRAD.","Coefficienti correttivi, da utilizzare se  ANNO CESPITE <2007, introdotti in applicazione delle disposizioni della deliberazione 21 dicembre 2009 ARG/gas 197/09 che modificano la vita utile dei cespiti, relativi rispettivamente agli anni tariffe 2009 (AT 2009 = I), 2010 (AT 2010 = II) e 2011 (AT 2011 = III), consentendo il recupero del minor ammortamento riconosciuto in tariffa per effetto dell’applicazione del meccanismo di gradualità. I coefficienti sono desumibili nell'area riservata di ciascun DSO."]
["ANNO DATI REINSTALLAZIONE","Anno in cui il misuratore viene reinstallato."]
[null,"REGOLE:\n- ANNO DATI REINSTALLAZIONE > ANNO DATI DISMISSIONE;\n- ANNO DATI REINSTALLAZIONE>=2020."]
[null,"Numero di misuratori disinstallati per verifica metrologica nell'anno di dismissione."]
[null,null,"REGOLE:\n-                                                > 0"]
{"$rows_left_out":1}
{"sheet":"TT Categorie cespite","index":1,"n_rows":19,"n_cols":4,"rows_kept":19,"cut":false,"hidden":false,"merged":[[18,2,18,3]]}
[]
["ID Categoria\n cespite","Categoria","ID\nElemento","Elemento"]
[5,"Misuratori elettronici",3,"G10"]
[5,"Misuratori elettronici",4,"G16"]
[5,"Misuratori elettronici",5,"G25"]
[5,"Misuratori elettronici",6,"G40"]
[5,"Misuratori elettronici",7,"G65"]
[5,"Misuratori elettronici",8,"G100"]
[5,"Misuratori elettronici",9,"G160"]
[5,"Misuratori elettronici",10,"G250"]
[5,"Misuratori elettronici",11,"G400"]
[5,"Misuratori elettronici",12,"G650"]
[5,"Misuratori elettronici",13,"G1000"]
[5,"Misuratori elettronici",14,"G1600"]
[5,"Misuratori elettronici",15,"G2500"]
{"$rows_left_out":5}
{"sheet":"NO COSTO STANDARD","index":2,"n_rows":150,"n_cols":14,"rows_kept":150,"cut":false,"hidden":false,"merged":[[1,0,1,3]]}
["INSERIRE SOLO VALORI PER I QUALI NON E' PREVISTA L'APPLICAZIONE DEL COSTO STANDARD"]
[]
["ANNO \nCESPITE\n(c)","ANNO DATI \nDISMISSIONE\n(t)",null,"ID CATEGORIA\n CESPITE\n(g)","INDICE \nGRAD  I","INDICE \nGRAD  II","INDICE \nGRAD  III","ANNO DATI \nREINSTALLAZIONE",null,null,null,"NUOVO ANNO CESPITE"]
[null,null,null,null,null,null,null,null,{"$f":"IF(CTRL!I4,0,fCalcoloFDGrad_159(B4,D4,A4,E4,F4,G4))","v":0},{"$f":"IF(CTRL!I4,0,dblfIFL(B4-1,A4))","v":0},{"$f":"IF(CTRL!I4,0,C4*(1-I4)*J4)","v":0},{"$f":"IF(CTRL!I4,0,H4)","v":0},{"$f":"IF(CTRL!I4,0,dblfIFL(H4-1,B4))","v":0},{"$f":"IF(CTRL!I4,0,K4*M4)","v":0}]
[null,null,null,null,null,null,null,null,{"$f":"IF(CTRL!I5,0,fCalcoloFDGrad_159(B5,D5,A5,E5,F5,G5))","v":0},{"$f":"IF(CTRL!I5,0,dblfIFL(B5-1,A5))","v":0},{"$f":"IF(CTRL!I5,0,C5*(1-I5)*J5)","v":0},{"$f":"IF(CTRL!I5,0,H5)","v":0},{"$f":"IF(CTRL!I5,0,dblfIFL(H5-1,B5))","v":0},{"$f":"IF(CTRL!I5,0,K5*M5)","v":0}]
[null,null,null,null,null,null,null,null,{"$f":"IF(CTRL!I6,0,fCalcoloFDGrad_159(B6,D6,A6,E6,F6,G6))","v":0},{"$f":"IF(CTRL!I6,0,dblfIFL(B6-1,A6))","v":0},{"$f":"IF(CTRL!I6,0,C6*(1-I6)*J6)","v":0},{"$f":"IF(CTRL!I6,0,H6)","v":0},{"$f":"IF(CTRL!I6,0,dblfIFL(H6-1,B6))","v":0},{"$f":"IF(CTRL!I6,0,K6*M6)","v":0}]
[null,null,null,null,null,null,null,null,{"$f":"IF(CTRL!I7,0,fCalcoloFDGrad_159(B7,D7,A7,E7,F7,G7))","v":0},{"$f":"IF(CTRL!I7,0,dblfIFL(B7-1,A7))","v":0},{"$f":"IF(CTRL!I7,0,C7*(1-I7)*J7)","v":0},{"$f":"IF(CTRL!I7,0,H7)","v":0},{"$f":"IF(CTRL!I7,0,dblfIFL(H7-1,B7))","v":0},{"$f":"IF(CTRL!I7,0,K7*M7)","v":0}]
[null,null,null,null,null,null,null,null,{"$f":"IF(CTRL!I8,0,fCalcoloFDGrad_159(B8,D8,A8,E8,F8,G8))","v":0},{"$f":"IF(CTRL!I8,0,dblfIFL(B8-1,A8))","v":0},{"$f":"IF(CTRL!I8,0,C8*(1-I8)*J8)","v":0},{"$f":"IF(CTRL!I8,0,H8)","v":0},{"$f":"IF(CTRL!I8,0,dblfIFL(H8-1,B8))","v":0},{"$f":"IF(CTRL!I8,0,K8*M8)","v":0}]
[null,null,null,null,null,null,null,null,{"$f":"IF(CTRL!I9,0,fCalcoloFDGrad_159(B9,D9,A9,E9,F9,G9))","v":0},{"$f":"IF(CTRL!I9,0,dblfIFL(B9-1,A9))","v":0},{"$f":"IF(CTRL!I9,0,C9*(1-I9)*J9)","v":0},{"$f":"IF(CTRL!I9,0,H9)","v":0},{"$f":"IF(CTRL!I9,0,dblfIFL(H9-1,B9))","v":0},{"$f":"IF(CTRL!I9,0,K9*M9)","v":0}]
[null,null,null,null,null,null,null,null,{"$f":"IF(CTRL!I10,0,fCalcoloFDGrad_159(B10,D10,A10,E10,F10,G10))","v":0},{"$f":"IF(CTRL!I10,0,dblfIFL(B10-1,A10))","v":0},{"$f":"IF(CTRL!I10,0,C10*(1-I10)*J10)","v":0},{"$f":"IF(CTRL!I10,0,H10)","v":0},{"$f":"IF(CTRL!I10,0,dblfIFL(H10-1,B10))","v":0},{"$f":"IF(CTRL!I10,0,K10*M10)","v":0}]
[null,null,null,null,null,null,null,null,{"$f":"IF(CTRL!I11,0,fCalcoloFDGrad_159(B11,D11,A11,E11,F11,G11))","v":0},{"$f":"IF(CTRL!I11,0,dblfIFL(B11-1,A11))","v":0},{"$f":"IF(CTRL!I11,0,C11*(1-I11)*J11)","v":0},{"$f":"IF(CTRL!I11,0,H11)","v":0},{"$f":"IF(CTRL!I11,0,dblfIFL(H11-1,B11))","v":0},{"$f":"IF(CTRL!I11,0,K11*M11)","v":0}]
[null,null,null,null,null,null,null,null,{"$f":"IF(CTRL!I12,0,fCalcoloFDGrad_159(B12,D12,A12,E12,F12,G12))","v":0},{"$f":"IF(CTRL!I12,0,dblfIFL(B12-1,A12))","v":0},{"$f":"IF(CTRL!I12,0,C12*(1-I12)*J12)","v":0},{"$f":"IF(CTRL!I12,0,H12)","v":0},{"$f":"IF(CTRL!I12,0,dblfIFL(H12-1,B12))","v":0},{"$f":"IF(CTRL!I12,0,K12*M12)","v":0}]
[null,null,null,null,null,null,null,null,{"$f":"IF(CTRL!I13,0,fCalcoloFDGrad_159(B13,D13,A13,E13,F13,G13))","v":0},{"$f":"IF(CTRL!I13,0,dblfIFL(B13-1,A13))","v":0},{"$f":"IF(CTRL!I13,0,C13*(1-I13)*J13)","v":0},{"$f":"IF(CTRL!I13,0,H13)","v":0},{"$f":"IF(CTRL!I13,0,dblfIFL(H13-1,B13))","v":0},{"$f":"IF(CTRL!I13,0,K13*M13)","v":0}]
[null,null,null,null,null,null,null,null,{"$f":"IF(CTRL!I14,0,fCalcoloFDGrad_159(B14,D14,A14,E14,F14,G14))","v":0},{"$f":"IF(CTRL!I14,0,dblfIFL(B14-1,A14))","v":0},{"$f":"IF(CTRL!I14,0,C14*(1-I14)*J14)","v":0},{"$f":"IF(CTRL!I14,0,H14)","v":0},{"$f":"IF(CTRL!I14,0,dblfIFL(H14-1,B14))","v":0},{"$f":"IF(CTRL!I14,0,K14*M14)","v":0}]
[null,null,null,null,null,null,null,null,{"$f":"IF(CTRL!I15,0,fCalcoloFDGrad_159(B15,D15,A15,E15,F15,G15))","v":0},{"$f":"IF(CTRL!I15,0,dblfIFL(B15-1,A15))","v":0},{"$f":"IF(CTRL!I15,0,C15*(1-I15)*J15)","v":0},{"$f":"IF(CTRL!I15,0,H15)","v":0},{"$f":"IF(CTRL!I15,0,dblfIFL(H15-1,B15))","v":0},{"$f":"IF(CTRL!I15,0,K15*M15)","v":0}]
{"$rows_left_out":136}
{"sheet":"COSTO STANDARD","index":3,"n_rows":150,"n_cols":18,"rows_kept":150,"cut":false,"hidden":false,"merged":[[1,0,1,10]]}
["INSERIRE SOLO VALORI PER I QUALI E' PREVISTA L'APPLICAZIONE DEL COSTO STANDARD"]
[]
["ANNO \nCESPITE\n(c)","ANNO DATI \nDISMISSIONE\n(t)",null,"ID CATEGORIA\n CESPITE\n(g)","ID\nELEMENTO",null,"ANNO DATI \nREINSTALLAZIONE",null,null,null,null,"VALORE LORDO  (RIVALUTATO ALL'ANNO DI DISMISSIONE)","COSTO STANDARD  (RIVALUTATO ALL'ANNO DI DISMISSIONE)","VALORE LORDO MEDIO  (RIVALUTATO ALL'ANNO DI DISMISSIONE)",null,null,"NUOVO ANNO CESPITE"]
[null,null,null,null,null,null,null,{"$f":"IF(CTRL!S4,0,dblfCS(A4,D4,E4))","v":0},{"$f":"IF(CTRL!S4,0,dblfIFL(B4-1,2011))","v":0},{"$f":"IF(CTRL!S4,0,fCalcoloFDGrad_159(B4,5,A4))","v":0},{"$f":"IF(CTRL!S4,0,dblfIFL(B4-1,A4))","v":0},{"$f":"IF(CTRL!S4,0,C4*K4)","v":0},{"$f":"IF(CTRL!S4,0,H4*F4*I4)","v":0},{"$f":"IF(CTRL!S4,0,fCostoStandard(A4,L4,M4))","v":0},{"$f":"IF(CTRL!S4,0,N4*(1-J4))","v":0},{"$f":"IF(CTRL!S4,0,dblfIFL(G4-1,B4))","v":0},{"$f":"IF(CTRL!S4,0,G4)","v":0},{"$f":"IF(CTRL!S4,0,O4*P4)","v":0}]
[null,null,null,null,null,null,null,{"$f":"IF(CTRL!S5,0,dblfCS(A5,D5,E5))","v":0},{"$f":"IF(CTRL!S5,0,dblfIFL(B5-1,2011))","v":0},{"$f":"IF(CTRL!S5,0,fCalcoloFDGrad_159(B5,5,A5))","v":0},{"$f":"IF(CTRL!S5,0,dblfIFL(B5-1,A5))","v":0},{"$f":"IF(CTRL!S5,0,C5*K5)","v":0},{"$f":"IF(CTRL!S5,0,H5*F5*I5)","v":0},{"$f":"IF(CTRL!S5,0,fCostoStandard(A5,L5,M5))","v":0},{"$f":"IF(CTRL!S5,0,N5*(1-J5))","v":0},{"$f":"IF(CTRL!S5,0,dblfIFL(G5-1,B5))","v":0},{"$f":"IF(CTRL!S5,0,G5)","v":0},{"$f":"IF(CTRL!S5,0,O5*P5)","v":0}]
[null,null,null,null,null,null,null,{"$f":"IF(CTRL!S6,0,dblfCS(A6,D6,E6))","v":0},{"$f":"IF(CTRL!S6,0,dblfIFL(B6-1,2011))","v":0},{"$f":"IF(CTRL!S6,0,fCalcoloFDGrad_159(B6,5,A6))","v":0},{"$f":"IF(CTRL!S6,0,dblfIFL(B6-1,A6))","v":0},{"$f":"IF(CTRL!S6,0,C6*K6)","v":0},{"$f":"IF(CTRL!S6,0,H6*F6*I6)","v":0},{"$f":"IF(CTRL!S6,0,fCostoStandard(A6,L6,M6))","v":0},{"$f":"IF(CTRL!S6,0,N6*(1-J6))","v":0},{"$f":"IF(CTRL!S6,0,dblfIFL(G6-1,B6))","v":0},{"$f":"IF(CTRL!S6,0,G6)","v":0},{"$f":"IF(CTRL!S6,0,O6*P6)","v":0}]
[null,null,null,null,null,null,null,{"$f":"IF(CTRL!S7,0,dblfCS(A7,D7,E7))","v":0},{"$f":"IF(CTRL!S7,0,dblfIFL(B7-1,2011))","v":0},{"$f":"IF(CTRL!S7,0,fCalcoloFDGrad_159(B7,5,A7))","v":0},{"$f":"IF(CTRL!S7,0,dblfIFL(B7-1,A7))","v":0},{"$f":"IF(CTRL!S7,0,C7*K7)","v":0},{"$f":"IF(CTRL!S7,0,H7*F7*I7)","v":0},{"$f":"IF(CTRL!S7,0,fCostoStandard(A7,L7,M7))","v":0},{"$f":"IF(CTRL!S7,0,N7*(1-J7))","v":0},{"$f":"IF(CTRL!S7,0,dblfIFL(G7-1,B7))","v":0},{"$f":"IF(CTRL!S7,0,G7)","v":0},{"$f":"IF(CTRL!S7,0,O7*P7)","v":0}]
[null,null,null,null,null,null,null,{"$f":"IF(CTRL!S8,0,dblfCS(A8,D8,E8))","v":0},{"$f":"IF(CTRL!S8,0,dblfIFL(B8-1,2011))","v":0},{"$f":"IF(CTRL!S8,0,fCalcoloFDGrad_159(B8,5,A8))","v":0},{"$f":"IF(CTRL!S8,0,dblfIFL(B8-1,A8))","v":0},{"$f":"IF(CTRL!S8,0,C8*K8)","v":0},{"$f":"IF(CTRL!S8,0,H8*F8*I8)","v":0},{"$f":"IF(CTRL!S8,0,fCostoStandard(A8,L8,M8))","v":0},{"$f":"IF(CTRL!S8,0,N8*(1-J8))","v":0},{"$f":"IF(CTRL!S8,0,dblfIFL(G8-1,B8))","v":0},{"$f":"IF(CTRL!S8,0,G8)","v":0},{"$f":"IF(CTRL!S8,0,O8*P8)","v":0}]
[null,null,null,null,null,null,null,{"$f":"IF(CTRL!S9,0,dblfCS(A9,D9,E9))","v":0},{"$f":"IF(CTRL!S9,0,dblfIFL(B9-1,2011))","v":0},{"$f":"IF(CTRL!S9,0,fCalcoloFDGrad_159(B9,5,A9))","v":0},{"$f":"IF(CTRL!S9,0,dblfIFL(B9-1,A9))","v":0},{"$f":"IF(CTRL!S9,0,C9*K9)","v":0},{"$f":"IF(CTRL!S9,0,H9*F9*I9)","v":0},{"$f":"IF(CTRL!S9,0,fCostoStandard(A9,L9,M9))","v":0},{"$f":"IF(CTRL!S9,0,N9*(1-J9))","v":0},{"$f":"IF(CTRL!S9,0,dblfIFL(G9-1,B9))","v":0},{"$f":"IF(CTRL!S9,0,G9)","v":0},{"$f":"IF(CTRL!S9,0,O9*P9)","v":0}]
[null,null,null,null,null,null,null,{"$f":"IF(CTRL!S10,0,dblfCS(A10,D10,E10))","v":0},{"$f":"IF(CTRL!S10,0,dblfIFL(B10-1,2011))","v":0},{"$f":"IF(CTRL!S10,0,fCalcoloFDGrad_159(B10,5,A10))","v":0},{"$f":"IF(CTRL!S10,0,dblfIFL(B10-1,A10))","v":0},{"$f":"IF(CTRL!S10,0,C10*K10)","v":0},{"$f":"IF(CTRL!S10,0,H10*F10*I10)","v":0},{"$f":"IF(CTRL!S10,0,fCostoStandard(A10,L10,M10))","v":0},{"$f":"IF(CTRL!S10,0,N10*(1-J10))","v":0},{"$f":"IF(CTRL!S10,0,dblfIFL(G10-1,B10))","v":0},{"$f":"IF(CTRL!S10,0,G10)","v":0},{"$f":"IF(CTRL!S10,0,O10*P10)","v":0}]
[null,null,null,null,null,null,null,{"$f":"IF(CTRL!S11,0,dblfCS(A11,D11,E11))","v":0},{"$f":"IF(CTRL!S11,0,dblfIFL(B11-1,2011))","v":0},{"$f":"IF(CTRL!S11,0,fCalcoloFDGrad_159(B11,5,A11))","v":0},{"$f":"IF(CTRL!S11,0,dblfIFL(B11-1,A11))","v":0},{"$f":"IF(CTRL!S11,0,C11*K11)","v":0},{"$f":"IF(CTRL!S11,0,H11*F11*I11)","v":0},{"$f":"IF(CTRL!S11,0,fCostoStandard(A11,L11,M11))","v":0},{"$f":"IF(CTRL!S11,0,N11*(1-J11))","v":0},{"$f":"IF(CTRL!S11,0,dblfIFL(G11-1,B11))","v":0},{"$f":"IF(CTRL!S11,0,G11)","v":0},{"$f":"IF(CTRL!S11,0,O11*P11)","v":0}]
[null,null,null,null,null,null,null,{"$f":"IF(CTRL!S12,0,dblfCS(A12,D12,E12))","v":0},{"$f":"IF(CTRL!S12,0,dblfIFL(B12-1,2011))","v":0},{"$f":"IF(CTRL!S12,0,fCalcoloFDGrad_159(B12,5,A12))","v":0},{"$f":"IF(CTRL!S12,0,dblfIFL(B12-1,A12))","v":0},{"$f":"IF(CTRL!S12,0,C12*K12)","v":0},{"$f":"IF(CTRL!S12,0,H12*F12*I12)","v":0},{"$f":"IF(CTRL!S12,0,fCostoStandard(A12,L12,M12))","v":0},{"$f":"IF(CTRL!S12,0,N12*(1-J12))","v":0},{"$f":"IF(CTRL!S12,0,dblfIFL(G12-1,B12))","v":0},{"$f":"IF(CTRL!S12,0,G12)","v":0},{"$f":"IF(CTRL!S12,0,O12*P12)","v":0}]
[null,null,null,null,null,null,null,{"$f":"IF(CTRL!S13,0,dblfCS(A13,D13,E13))","v":0},{"$f":"IF(CTRL!S13,0,dblfIFL(B13-1,2011))","v":0},{"$f":"IF(CTRL!S13,0,fCalcoloFDGrad_159(B13,5,A13))","v":0},{"$f":"IF(CTRL!S13,0,dblfIFL(B13-1,A13))","v":0},{"$f":"IF(CTRL!S13,0,C13*K13)","v":0},{"$f":"IF(CTRL!S13,0,H13*F13*I13)","v":0},{"$f":"IF(CTRL!S13,0,fCostoStandard(A13,L13,M13))","v":0},{"$f":"IF(CTRL!S13,0,N13*(1-J13))","v":0},{"$f":"IF(CTRL!S13,0,dblfIFL(G13-1,B13))","v":0},{"$f":"IF(CTRL!S13,0,G13)","v":0},{"$f":"IF(CTRL!S13,0,O13*P13)","v":0}]
[null,null,null,null,null,null,null,{"$f":"IF(CTRL!S14,0,dblfCS(A14,D14,E14))","v":0},{"$f":"IF(CTRL!S14,0,dblfIFL(B14-1,2011))","v":0},{"$f":"IF(CTRL!S14,0,fCalcoloFDGrad_159(B14,5,A14))","v":0},{"$f":"IF(CTRL!S14,0,dblfIFL(B14-1,A14))","v":0},{"$f":"IF(CTRL!S14,0,C14*K14)","v":0},{"$f":"IF(CTRL!S14,0,H14*F14*I14)","v":0},{"$f":"IF(CTRL!S14,0,fCostoStandard(A14,L14,M14))","v":0},{"$f":"IF(CTRL!S14,0,N14*(1-J14))","v":0},{"$f":"IF(CTRL!S14,0,dblfIFL(G14-1,B14))","v":0},{"$f":"IF(CTRL!S14,0,G14)","v":0},{"$f":"IF(CTRL!S14,0,O14*P14)","v":0}]
[null,null,null,null,null,null,null,{"$f":"IF(CTRL!S15,0,dblfCS(A15,D15,E15))","v":0},{"$f":"IF(CTRL!S15,0,dblfIFL(B15-1,2011))","v":0},{"$f":"IF(CTRL!S15,0,fCalcoloFDGrad_159(B15,5,A15))","v":0},{"$f":"IF(CTRL!S15,0,dblfIFL(B15-1,A15))","v":0},{"$f":"IF(CTRL!S15,0,C15*K15)","v":0},{"$f":"IF(CTRL!S15,0,H15*F15*I15)","v":0},{"$f":"IF(CTRL!S15,0,fCostoStandard(A15,L15,M15))","v":0},{"$f":"IF(CTRL!S15,0,N15*(1-J15))","v":0},{"$f":"IF(CTRL!S15,0,dblfIFL(G15-1,B15))","v":0},{"$f":"IF(CTRL!S15,0,G15)","v":0},{"$f":"IF(CTRL!S15,0,O15*P15)","v":0}]
{"$rows_left_out":136}
{"sheet":"CTRL","index":4,"n_rows":150,"n_cols":19,"rows_kept":150,"cut":false,"hidden":false,"merged":[]}
[]
["DISMISSIONI NO COSTO STANDARD",null,null,null,null,null,null,null,null,null,null,"DISMISSIONI COSTO STANDARD"]
["CTRL RIGA",null,null,null,null,null,null,null,null,null,null,"CTRL RIGA"]
[1,{"$f":"+'NO COSTO STANDARD'!D4=13","v":false},{"$f":"+'NO COSTO STANDARD'!B4<='NO COSTO STANDARD'!A4","v":true},{"$f":"AND('NO COSTO STANDARD'!A4>2011,'NO COSTO STANDARD'!D4=5)","v":false},{"$f":"+'NO COSTO STANDARD'!B4<=2008","v":true},{"$f":"+'NO COSTO STANDARD'!B4>='NO COSTO STANDARD'!H4","v":true},{"$f":"+'NO COSTO STANDARD'!H4<2020","v":true},{"$f":"+'NO COSTO STANDARD'!A4<=0","v":true},{"$f":"OR(B4,C4,D4,E4,F4,G4,H4)","v":true},null,null,1,{"$f":"+'COSTO STANDARD'!D4=6","v":false},{"$f":"OR('COSTO STANDARD'!A4<2012,'COSTO STANDARD'!A4<=0)","v":true},{"$f":"+'COSTO STANDARD'!B4<='COSTO STANDARD'!A4","v":true},{"$f":"+'COSTO STANDARD'!F4<=0","v":true},{"$f":"+'COSTO STANDARD'!B4>='COSTO STANDARD'!G4","v":true},{"$f":"+'COSTO STANDARD'!G4<2020","v":true},{"$f":"OR(M4,N4,O4,P4,Q4,R4)","v":true}]
[{"$f":"+A4+1","v":2},{"$f":"+'NO COSTO STANDARD'!D5=13","v":false},{"$f":"+'NO COSTO STANDARD'!B5<='NO COSTO STANDARD'!A5","v":true},{"$f":"AND('NO COSTO STANDARD'!A5>2011,'NO COSTO STANDARD'!D5=5)","v":false},{"$f":"+'NO COSTO STANDARD'!B5<=2008","v":true},{"$f":"+'NO COSTO STANDARD'!B5>='NO COSTO STANDARD'!H5","v":true},{"$f":"+'NO COSTO STANDARD'!H5<2020","v":true},{"$f":"+'NO COSTO STANDARD'!A5<=0","v":true},{"$f":"OR(B5,C5,D5,E5,F5,G5,H5)","v":true},null,null,{"$f":"+L4+1","v":2},{"$f":"+'COSTO STANDARD'!D5=6","v":false},{"$f":"OR('COSTO STANDARD'!A5<2012,'COSTO STANDARD'!A5<=0)","v":true},{"$f":"+'COSTO STANDARD'!B5<='COSTO STANDARD'!A5","v":true},{"$f":"+'COSTO STANDARD'!F5<=0","v":true},{"$f":"+'COSTO STANDARD'!B5>='COSTO STANDARD'!G5","v":true},{"$f":"+'COSTO STANDARD'!G5<2020","v":true},{"$f":"OR(M5,N5,O5,P5,Q5,R5)","v":true}]
[{"$f":"+A5+1","v":3},{"$f":"+'NO COSTO STANDARD'!D6=13","v":false},{"$f":"+'NO COSTO STANDARD'!B6<='NO COSTO STANDARD'!A6","v":true},{"$f":"AND('NO COSTO STANDARD'!A6>2011,'NO COSTO STANDARD'!D6=5)","v":false},{"$f":"+'NO COSTO STANDARD'!B6<=2008","v":true},{"$f":"+'NO COSTO STANDARD'!B6>='NO COSTO STANDARD'!H6","v":true},{"$f":"+'NO COSTO STANDARD'!H6<2020","v":true},{"$f":"+'NO COSTO STANDARD'!A6<=0","v":true},true,null,null,{"$f":"+L5+1","v":3},{"$f":"+'COSTO STANDARD'!D6=6","v":false},{"$f":"OR('COSTO STANDARD'!A6<2012,'COSTO STANDARD'!A6<=0)","v":true},{"$f":"+'COSTO STANDARD'!B6<='COSTO STANDARD'!A6","v":true},{"$f":"+'COSTO STANDARD'!F6<=0","v":true},{"$f":"+'COSTO STANDARD'!B6>='COSTO STANDARD'!G6","v":true},{"$f":"+'COSTO STANDARD'!G6<2020","v":true},true]
[4,{"$f":"+'NO COSTO STANDARD'!D7=13","v":false},{"$f":"+'NO COSTO STANDARD'!B7<='NO COSTO STANDARD'!A7","v":true},{"$f":"AND('NO COSTO STANDARD'!A7>2011,'NO COSTO STANDARD'!D7=5)","v":false},{"$f":"+'NO COSTO STANDARD'!B7<=2008","v":true},{"$f":"+'NO COSTO STANDARD'!B7>='NO COSTO STANDARD'!H7","v":true},{"$f":"+'NO COSTO STANDARD'!H7<2020","v":true},{"$f":"+'NO COSTO STANDARD'!A7<=0","v":true},true,null,null,4,{"$f":"+'COSTO STANDARD'!D7=6","v":false},{"$f":"OR('COSTO STANDARD'!A7<2012,'COSTO STANDARD'!A7<=0)","v":true},{"$f":"+'COSTO STANDARD'!B7<='COSTO STANDARD'!A7","v":true},{"$f":"+'COSTO STANDARD'!F7<=0","v":true},{"$f":"+'COSTO STANDARD'!B7>='COSTO STANDARD'!G7","v":true},{"$f":"+'COSTO STANDARD'!G7<2020","v":true},true]
[5,{"$f":"+'NO COSTO STANDARD'!D8=13","v":false},{"$f":"+'NO COSTO STANDARD'!B8<='NO COSTO STANDARD'!A8","v":true},{"$f":"AND('NO COSTO STANDARD'!A8>2011,'NO COSTO STANDARD'!D8=5)","v":false},{"$f":"+'NO COSTO STANDARD'!B8<=2008","v":true},{"$f":"+'NO COSTO STANDARD'!B8>='NO COSTO STANDARD'!H8","v":true},{"$f":"+'NO COSTO STANDARD'!H8<2020","v":true},{"$f":"+'NO COSTO STANDARD'!A8<=0","v":true},true,null,null,5,{"$f":"+'COSTO STANDARD'!D8=6","v":false},{"$f":"OR('COSTO STANDARD'!A8<2012,'COSTO STANDARD'!A8<=0)","v":true},{"$f":"+'COSTO STANDARD'!B8<='COSTO STANDARD'!A8","v":true},{"$f":"+'COSTO STANDARD'!F8<=0","v":true},{"$f":"+'COSTO STANDARD'!B8>='COSTO STANDARD'!G8","v":true},{"$f":"+'COSTO STANDARD'!G8<2020","v":true},true]
[6,{"$f":"+'NO COSTO STANDARD'!D9=13","v":false},{"$f":"+'NO COSTO STANDARD'!B9<='NO COSTO STANDARD'!A9","v":true},{"$f":"AND('NO COSTO STANDARD'!A9>2011,'NO COSTO STANDARD'!D9=5)","v":false},{"$f":"+'NO COSTO STANDARD'!B9<=2008","v":true},{"$f":"+'NO COSTO STANDARD'!B9>='NO COSTO STANDARD'!H9","v":true},{"$f":"+'NO COSTO STANDARD'!H9<2020","v":true},{"$f":"+'NO COSTO STANDARD'!A9<=0","v":true},true,null,null,6,{"$f":"+'COSTO STANDARD'!D9=6","v":false},{"$f":"OR('COSTO STANDARD'!A9<2012,'COSTO STANDARD'!A9<=0)","v":true},{"$f":"+'COSTO STANDARD'!B9<='COSTO STANDARD'!A9","v":true},{"$f":"+'COSTO STANDARD'!F9<=0","v":true},{"$f":"+'COSTO STANDARD'!B9>='COSTO STANDARD'!G9","v":true},{"$f":"+'COSTO STANDARD'!G9<2020","v":true},true]
[7,{"$f":"+'NO COSTO STANDARD'!D10=13","v":false},{"$f":"+'NO COSTO STANDARD'!B10<='NO COSTO STANDARD'!A10","v":true},{"$f":"AND('NO COSTO STANDARD'!A10>2011,'NO COSTO STANDARD'!D10=5)","v":false},{"$f":"+'NO COSTO STANDARD'!B10<=2008","v":true},{"$f":"+'NO COSTO STANDARD'!B10>='NO COSTO STANDARD'!H10","v":true},{"$f":"+'NO COSTO STANDARD'!H10<2020","v":true},{"$f":"+'NO COSTO STANDARD'!A10<=0","v":true},true,null,null,7,{"$f":"+'COSTO STANDARD'!D10=6","v":false},{"$f":"OR('COSTO STANDARD'!A10<2012,'COSTO STANDARD'!A10<=0)","v":true},{"$f":"+'COSTO STANDARD'!B10<='COSTO STANDARD'!A10","v":true},{"$f":"+'COSTO STANDARD'!F10<=0","v":true},{"$f":"+'COSTO STANDARD'!B10>='COSTO STANDARD'!G10","v":true},{"$f":"+'COSTO STANDARD'!G10<2020","v":true},true]
[8,{"$f":"+'NO COSTO STANDARD'!D11=13","v":false},{"$f":"+'NO COSTO STANDARD'!B11<='NO COSTO STANDARD'!A11","v":true},{"$f":"AND('NO COSTO STANDARD'!A11>2011,'NO COSTO STANDARD'!D11=5)","v":false},{"$f":"+'NO COSTO STANDARD'!B11<=2008","v":true},{"$f":"+'NO COSTO STANDARD'!B11>='NO COSTO STANDARD'!H11","v":true},{"$f":"+'NO COSTO STANDARD'!H11<2020","v":true},{"$f":"+'NO COSTO STANDARD'!A11<=0","v":true},true,null,null,8,{"$f":"+'COSTO STANDARD'!D11=6","v":false},{"$f":"OR('COSTO STANDARD'!A11<2012,'COSTO STANDARD'!A11<=0)","v":true},{"$f":"+'COSTO STANDARD'!B11<='COSTO STANDARD'!A11","v":true},{"$f":"+'COSTO STANDARD'!F11<=0","v":true},{"$f":"+'COSTO STANDARD'!B11>='COSTO STANDARD'!G11","v":true},{"$f":"+'COSTO STANDARD'!G11<2020","v":true},true]
[9,{"$f":"+'NO COSTO STANDARD'!D12=13","v":false},{"$f":"+'NO COSTO STANDARD'!B12<='NO COSTO STANDARD'!A12","v":true},{"$f":"AND('NO COSTO STANDARD'!A12>2011,'NO COSTO STANDARD'!D12=5)","v":false},{"$f":"+'NO COSTO STANDARD'!B12<=2008","v":true},{"$f":"+'NO COSTO STANDARD'!B12>='NO COSTO STANDARD'!H12","v":true},{"$f":"+'NO COSTO STANDARD'!H12<2020","v":true},{"$f":"+'NO COSTO STANDARD'!A12<=0","v":true},true,null,null,9,{"$f":"+'COSTO STANDARD'!D12=6","v":false},{"$f":"OR('COSTO STANDARD'!A12<2012,'COSTO STANDARD'!A12<=0)","v":true},{"$f":"+'COSTO STANDARD'!B12<='COSTO STANDARD'!A12","v":true},{"$f":"+'COSTO STANDARD'!F12<=0","v":true},{"$f":"+'COSTO STANDARD'!B12>='COSTO STANDARD'!G12","v":true},{"$f":"+'COSTO STANDARD'!G12<2020","v":true},true]
[10,{"$f":"+'NO COSTO STANDARD'!D13=13","v":false},{"$f":"+'NO COSTO STANDARD'!B13<='NO COSTO STANDARD'!A13","v":true},{"$f":"AND('NO COSTO STANDARD'!A13>2011,'NO COSTO STANDARD'!D13=5)","v":false},{"$f":"+'NO COSTO STANDARD'!B13<=2008","v":true},{"$f":"+'NO COSTO STANDARD'!B13>='NO COSTO STANDARD'!H13","v":true},{"$f":"+'NO COSTO STANDARD'!H13<2020","v":true},{"$f":"+'NO COSTO STANDARD'!A13<=0","v":true},true,null,null,10,{"$f":"+'COSTO STANDARD'!D13=6","v":false},{"$f":"OR('COSTO STANDARD'!A13<2012,'COSTO STANDARD'!A13<=0)","v":true},{"$f":"+'COSTO STANDARD'!B13<='COSTO STANDARD'!A13","v":true},{"$f":"+'COSTO STANDARD'!F13<=0","v":true},{"$f":"+'COSTO STANDARD'!B13>='COSTO STANDARD'!G13","v":true},{"$f":"+'COSTO STANDARD'!G13<2020","v":true},true]
[11,{"$f":"+'NO COSTO STANDARD'!D14=13","v":false},{"$f":"+'NO COSTO STANDARD'!B14<='NO COSTO STANDARD'!A14","v":true},{"$f":"AND('NO COSTO STANDARD'!A14>2011,'NO COSTO STANDARD'!D14=5)","v":false},{"$f":"+'NO COSTO STANDARD'!B14<=2008","v":true},{"$f":"+'NO COSTO STANDARD'!B14>='NO COSTO STANDARD'!H14","v":true},{"$f":"+'NO COSTO STANDARD'!H14<2020","v":true},{"$f":"+'NO COSTO STANDARD'!A14<=0","v":true},true,null,null,11,{"$f":"+'COSTO STANDARD'!D14=6","v":false},{"$f":"OR('COSTO STANDARD'!A14<2012,'COSTO STANDARD'!A14<=0)","v":true},{"$f":"+'COSTO STANDARD'!B14<='COSTO STANDARD'!A14","v":true},{"$f":"+'COSTO STANDARD'!F14<=0","v":true},{"$f":"+'COSTO STANDARD'!B14>='COSTO STANDARD'!G14","v":true},{"$f":"+'COSTO STANDARD'!G14<2020","v":true},true]
[12,{"$f":"+'NO COSTO STANDARD'!D15=13","v":false},{"$f":"+'NO COSTO STANDARD'!B15<='NO COSTO STANDARD'!A15","v":true},{"$f":"AND('NO COSTO STANDARD'!A15>2011,'NO COSTO STANDARD'!D15=5)","v":false},{"$f":"+'NO COSTO STANDARD'!B15<=2008","v":true},{"$f":"+'NO COSTO STANDARD'!B15>='NO COSTO STANDARD'!H15","v":true},{"$f":"+'NO COSTO STANDARD'!H15<2020","v":true},{"$f":"+'NO COSTO STANDARD'!A15<=0","v":true},true,null,null,12,{"$f":"+'COSTO STANDARD'!D15=6","v":false},{"$f":"OR('COSTO STANDARD'!A15<2012,'COSTO STANDARD'!A15<=0)","v":true},{"$f":"+'COSTO STANDARD'!B15<='COSTO STANDARD'!A15","v":true},{"$f":"+'COSTO STANDARD'!F15<=0","v":true},{"$f":"+'COSTO STANDARD'!B15>='COSTO STANDARD'!G15","v":true},{"$f":"+'COSTO STANDARD'!G15<2020","v":true},true]
{"$rows_left_out":135}